{"text_format":"1","workbook":"xlsx","n_sheets":4,"sheets":["Schools & Students","Disability Type","Sheet1","ValidationLists"],"not_rendered":{"charts":0,"images":1,"macros":1,"external_links":0,"defined_names":7,"comments":0,"pivot_tables":0},"unopened":[],"bounds":{"document_bytes":16777216,"sheet_cells":100000,"rows_first":2000,"rows_last":500,"rows_between":2000,"halvings":0,"cell_chars":16384,"cell_head_chars":4096},"cells_cut":0,"cells_raw":0,"read":"whole","date_system":"1900"}

{"sheet":"Schools & Students","index":0,"n_rows":694,"n_cols":7,"rows_kept":694,"cut":false,"hidden":false,"merged":[[2,0,2,6],[3,0,3,6],[1,0,1,6]]}
["PART THREE - Resource Centre Services"]
["SPECIALIST DISABILITY SUPPORT IN SCHOOLS (SDSS) PROGRAM "]
["Student and School Data - Indicate your forecast data for one school year in this sheet"]
["Organisation Name: "]
["NAME OF SCHOOL ACCESSING SERVICE\nPlease click on each line and choose a school from the drop down list.","SCHOOL CODE","REGION","CENTRE TYPE ","Number of eligible students identified at the NCCD adjustment level of Supplementary, Substantial or Extensive                                                  and                                                                     New students where the school requires immediate support for student access and participate in learning and/or for their safe attendance at school. ","RANGE OF DISABILITIES                              Using the drop down option, please provide a list of the primary impairment areas that your organisation expects to provide SDSS services for.                                            Note: Multiple options can be chosen here for the school listed in the first column.","OTHER DISABILITY \nIf the relevant disability is not available in the drop down choices in Column F, please enter the type of disability in this column."]
[null,{"$f":"VLOOKUP(A6,ValidationLists!$1:$1048576,2,)","v":{"$error":"#N/A"}},{"$f":"VLOOKUP(A6,ValidationLists!$1:$1048576,4,)","v":{"$error":"#N/A"}},{"$f":"VLOOKUP(A6,ValidationLists!$1:$1048576,3,)","v":{"$error":"#N/A"}}]
[null,{"$f":"VLOOKUP(A7,ValidationLists!$1:$1048576,2,)","v":{"$error":"#N/A"}},{"$f":"VLOOKUP(A7,ValidationLists!$1:$1048576,4,)","v":{"$error":"#N/A"}},{"$f":"VLOOKUP(A7,ValidationLists!$1:$1048576,3,)","v":{"$error":"#N/A"}}]
[null,{"$f":"VLOOKUP(A8,ValidationLists!$1:$1048576,2,)","v":{"$error":"#N/A"}},{"$f":"VLOOKUP(A8,ValidationLists!$1:$1048576,4,)","v":{"$error":"#N/A"}},{"$f":"VLOOKUP(A8,ValidationLists!$1:$1048576,3,)","v":{"$error":"#N/A"}}]
[null,{"$f":"VLOOKUP(A9,ValidationLists!$1:$1048576,2,)","v":{"$error":"#N/A"}},{"$f":"VLOOKUP(A9,ValidationLists!$1:$1048576,4,)","v":{"$error":"#N/A"}},{"$f":"VLOOKUP(A9,ValidationLists!$1:$1048576,3,)","v":{"$error":"#N/A"}}]
[null,{"$f":"VLOOKUP(A10,ValidationLists!$1:$1048576,2,)","v":{"$error":"#N/A"}},{"$f":"VLOOKUP(A10,ValidationLists!$1:$1048576,4,)","v":{"$error":"#N/A"}},{"$f":"VLOOKUP(A10,ValidationLists!$1:$1048576,3,)","v":{"$error":"#N/A"}}]
[null,{"$f":"VLOOKUP(A11,ValidationLists!$1:$1048576,2,)","v":{"$error":"#N/A"}},{"$f":"VLOOKUP(A11,ValidationLists!$1:$1048576,4,)","v":{"$error":"#N/A"}},{"$f":"VLOOKUP(A11,ValidationLists!$1:$1048576,3,)","v":{"$error":"#N/A"}}]
[null,{"$f":"VLOOKUP(A12,ValidationLists!$1:$1048576,2,)","v":{"$error":"#N/A"}},{"$f":"VLOOKUP(A12,ValidationLists!$1:$1048576,4,)","v":{"$error":"#N/A"}},{"$f":"VLOOKUP(A12,ValidationLists!$1:$1048576,3,)","v":{"$error":"#N/A"}}]
[null,{"$f":"VLOOKUP(A13,ValidationLists!$1:$1048576,2,)","v":{"$error":"#N/A"}},{"$f":"VLOOKUP(A13,ValidationLists!$1:$1048576,4,)","v":{"$error":"#N/A"}},{"$f":"VLOOKUP(A13,ValidationLists!$1:$1048576,3,)","v":{"$error":"#N/A"}}]
[null,{"$f":"VLOOKUP(A14,ValidationLists!$1:$1048576,2,)","v":{"$error":"#N/A"}},{"$f":"VLOOKUP(A14,ValidationLists!$1:$1048576,4,)","v":{"$error":"#N/A"}},{"$f":"VLOOKUP(A14,ValidationLists!$1:$1048576,3,)","v":{"$error":"#N/A"}}]
[null,{"$f":"VLOOKUP(A15,ValidationLists!$1:$1048576,2,)","v":{"$error":"#N/A"}},{"$f":"VLOOKUP(A15,ValidationLists!$1:$1048576,4,)","v":{"$error":"#N/A"}},{"$f":"VLOOKUP(A15,ValidationLists!$1:$1048576,3,)","v":{"$error":"#N/A"}}]
[null,{"$f":"VLOOKUP(A16,ValidationLists!$1:$1048576,2,)","v":{"$error":"#N/A"}},{"$f":"VLOOKUP(A16,ValidationLists!$1:$1048576,4,)","v":{"$error":"#N/A"}},{"$f":"VLOOKUP(A16,ValidationLists!$1:$1048576,3,)","v":{"$error":"#N/A"}}]
[null,{"$f":"VLOOKUP(A17,ValidationLists!$1:$1048576,2,)","v":{"$error":"#N/A"}},{"$f":"VLOOKUP(A17,ValidationLists!$1:$1048576,4,)","v":{"$error":"#N/A"}},{"$f":"VLOOKUP(A17,ValidationLists!$1:$1048576,3,)","v":{"$error":"#N/A"}}]
[null,{"$f":"VLOOKUP(A18,ValidationLists!$1:$1048576,2,)","v":{"$error":"#N/A"}},{"$f":"VLOOKUP(A18,ValidationLists!$1:$1048576,4,)","v":{"$error":"#N/A"}},{"$f":"VLOOKUP(A18,ValidationLists!$1:$1048576,3,)","v":{"$error":"#N/A"}}]
[null,{"$f":"VLOOKUP(A19,ValidationLists!$1:$1048576,2,)","v":{"$error":"#N/A"}},{"$f":"VLOOKUP(A19,ValidationLists!$1:$1048576,4,)","v":{"$error":"#N/A"}},{"$f":"VLOOKUP(A19,ValidationLists!$1:$1048576,3,)","v":{"$error":"#N/A"}}]
[null,{"$f":"VLOOKUP(A20,ValidationLists!$1:$1048576,2,)","v":{"$error":"#N/A"}},{"$f":"VLOOKUP(A20,ValidationLists!$1:$1048576,4,)","v":{"$error":"#N/A"}},{"$f":"VLOOKUP(A20,ValidationLists!$1:$1048576,3,)","v":{"$error":"#N/A"}}]
[null,{"$f":"VLOOKUP(A21,ValidationLists!$1:$1048576,2,)","v":{"$error":"#N/A"}},{"$f":"VLOOKUP(A21,ValidationLists!$1:$1048576,4,)","v":{"$error":"#N/A"}},{"$f":"VLOOKUP(A21,ValidationLists!$1:$1048576,3,)","v":{"$error":"#N/A"}}]
[null,{"$f":"VLOOKUP(A22,ValidationLists!$1:$1048576,2,)","v":{"$error":"#N/A"}},{"$f":"VLOOKUP(A22,ValidationLists!$1:$1048576,4,)","v":{"$error":"#N/A"}},{"$f":"VLOOKUP(A22,ValidationLists!$1:$1048576,3,)","v":{"$error":"#N/A"}}]
[null,{"$f":"VLOOKUP(A23,ValidationLists!$1:$1048576,2,)","v":{"$error":"#N/A"}},{"$f":"VLOOKUP(A23,ValidationLists!$1:$1048576,4,)","v":{"$error":"#N/A"}},{"$f":"VLOOKUP(A23,ValidationLists!$1:$1048576,3,)","v":{"$error":"#N/A"}}]
[null,{"$f":"VLOOKUP(A24,ValidationLists!$1:$1048576,2,)","v":{"$error":"#N/A"}},{"$f":"VLOOKUP(A24,ValidationLists!$1:$1048576,4,)","v":{"$error":"#N/A"}},{"$f":"VLOOKUP(A24,ValidationLists!$1:$1048576,3,)","v":{"$error":"#N/A"}}]
[null,{"$f":"VLOOKUP(A25,ValidationLists!$1:$1048576,2,)","v":{"$error":"#N/A"}},{"$f":"VLOOKUP(A25,ValidationLists!$1:$1048576,4,)","v":{"$error":"#N/A"}},{"$f":"VLOOKUP(A25,ValidationLists!$1:$1048576,3,)","v":{"$error":"#N/A"}}]
[null,{"$f":"VLOOKUP(A26,ValidationLists!$1:$1048576,2,)","v":{"$error":"#N/A"}},{"$f":"VLOOKUP(A26,ValidationLists!$1:$1048576,4,)","v":{"$error":"#N/A"}},{"$f":"VLOOKUP(A26,ValidationLists!$1:$1048576,3,)","v":{"$error":"#N/A"}}]
[null,{"$f":"VLOOKUP(A27,ValidationLists!$1:$1048576,2,)","v":{"$error":"#N/A"}},{"$f":"VLOOKUP(A27,ValidationLists!$1:$1048576,4,)","v":{"$error":"#N/A"}},{"$f":"VLOOKUP(A27,ValidationLists!$1:$1048576,3,)","v":{"$error":"#N/A"}}]
[null,{"$f":"VLOOKUP(A28,ValidationLists!$1:$1048576,2,)","v":{"$error":"#N/A"}},{"$f":"VLOOKUP(A28,ValidationLists!$1:$1048576,4,)","v":{"$error":"#N/A"}},{"$f":"VLOOKUP(A28,ValidationLists!$1:$1048576,3,)","v":{"$error":"#N/A"}}]
[null,{"$f":"VLOOKUP(A29,ValidationLists!$1:$1048576,2,)","v":{"$error":"#N/A"}},{"$f":"VLOOKUP(A29,ValidationLists!$1:$1048576,4,)","v":{"$error":"#N/A"}},{"$f":"VLOOKUP(A29,ValidationLists!$1:$1048576,3,)","v":{"$error":"#N/A"}}]
[null,{"$f":"VLOOKUP(A30,ValidationLists!$1:$1048576,2,)","v":{"$error":"#N/A"}},{"$f":"VLOOKUP(A30,ValidationLists!$1:$1048576,4,)","v":{"$error":"#N/A"}},{"$f":"VLOOKUP(A30,ValidationLists!$1:$1048576,3,)","v":{"$error":"#N/A"}}]
[null,{"$f":"VLOOKUP(A31,ValidationLists!$1:$1048576,2,)","v":{"$error":"#N/A"}},{"$f":"VLOOKUP(A31,ValidationLists!$1:$1048576,4,)","v":{"$error":"#N/A"}},{"$f":"VLOOKUP(A31,ValidationLists!$1:$1048576,3,)","v":{"$error":"#N/A"}}]
[null,{"$f":"VLOOKUP(A32,ValidationLists!$1:$1048576,2,)","v":{"$error":"#N/A"}},{"$f":"VLOOKUP(A32,ValidationLists!$1:$1048576,4,)","v":{"$error":"#N/A"}},{"$f":"VLOOKUP(A32,ValidationLists!$1:$1048576,3,)","v":{"$error":"#N/A"}}]
[null,{"$f":"VLOOKUP(A33,ValidationLists!$1:$1048576,2,)","v":{"$error":"#N/A"}},{"$f":"VLOOKUP(A33,ValidationLists!$1:$1048576,4,)","v":{"$error":"#N/A"}},{"$f":"VLOOKUP(A33,ValidationLists!$1:$1048576,3,)","v":{"$error":"#N/A"}}]
[null,{"$f":"VLOOKUP(A34,ValidationLists!$1:$1048576,2,)","v":{"$error":"#N/A"}},{"$f":"VLOOKUP(A34,ValidationLists!$1:$1048576,4,)","v":{"$error":"#N/A"}},{"$f":"VLOOKUP(A34,ValidationLists!$1:$1048576,3,)","v":{"$error":"#N/A"}}]
[null,{"$f":"VLOOKUP(A35,ValidationLists!$1:$1048576,2,)","v":{"$error":"#N/A"}},{"$f":"VLOOKUP(A35,ValidationLists!$1:$1048576,4,)","v":{"$error":"#N/A"}},{"$f":"VLOOKUP(A35,ValidationLists!$1:$1048576,3,)","v":{"$error":"#N/A"}}]
[null,{"$f":"VLOOKUP(A36,ValidationLists!$1:$1048576,2,)","v":{"$error":"#N/A"}},{"$f":"VLOOKUP(A36,ValidationLists!$1:$1048576,4,)","v":{"$error":"#N/A"}},{"$f":"VLOOKUP(A36,ValidationLists!$1:$1048576,3,)","v":{"$error":"#N/A"}}]
[null,{"$f":"VLOOKUP(A37,ValidationLists!$1:$1048576,2,)","v":{"$error":"#N/A"}},{"$f":"VLOOKUP(A37,ValidationLists!$1:$1048576,4,)","v":{"$error":"#N/A"}},{"$f":"VLOOKUP(A37,ValidationLists!$1:$1048576,3,)","v":{"$error":"#N/A"}}]
[null,{"$f":"VLOOKUP(A38,ValidationLists!$1:$1048576,2,)","v":{"$error":"#N/A"}},{"$f":"VLOOKUP(A38,ValidationLists!$1:$1048576,4,)","v":{"$error":"#N/A"}},{"$f":"VLOOKUP(A38,ValidationLists!$1:$1048576,3,)","v":{"$error":"#N/A"}}]
[null,{"$f":"VLOOKUP(A39,ValidationLists!$1:$1048576,2,)","v":{"$error":"#N/A"}},{"$f":"VLOOKUP(A39,ValidationLists!$1:$1048576,4,)","v":{"$error":"#N/A"}},{"$f":"VLOOKUP(A39,ValidationLists!$1:$1048576,3,)","v":{"$error":"#N/A"}}]
[null,{"$f":"VLOOKUP(A40,ValidationLists!$1:$1048576,2,)","v":{"$error":"#N/A"}},{"$f":"VLOOKUP(A40,ValidationLists!$1:$1048576,4,)","v":{"$error":"#N/A"}},{"$f":"VLOOKUP(A40,ValidationLists!$1:$1048576,3,)","v":{"$error":"#N/A"}}]
[null,{"$f":"VLOOKUP(A41,ValidationLists!$1:$1048576,2,)","v":{"$error":"#N/A"}},{"$f":"VLOOKUP(A41,ValidationLists!$1:$1048576,4,)","v":{"$error":"#N/A"}},{"$f":"VLOOKUP(A41,ValidationLists!$1:$1048576,3,)","v":{"$error":"#N/A"}}]
[null,{"$f":"VLOOKUP(A42,ValidationLists!$1:$1048576,2,)","v":{"$error":"#N/A"}},{"$f":"VLOOKUP(A42,ValidationLists!$1:$1048576,4,)","v":{"$error":"#N/A"}},{"$f":"VLOOKUP(A42,ValidationLists!$1:$1048576,3,)","v":{"$error":"#N/A"}}]
[null,{"$f":"VLOOKUP(A43,ValidationLists!$1:$1048576,2,)","v":{"$error":"#N/A"}},{"$f":"VLOOKUP(A43,ValidationLists!$1:$1048576,4,)","v":{"$error":"#N/A"}},{"$f":"VLOOKUP(A43,ValidationLists!$1:$1048576,3,)","v":{"$error":"#N/A"}}]
[null,{"$f":"VLOOKUP(A44,ValidationLists!$1:$1048576,2,)","v":{"$error":"#N/A"}},{"$f":"VLOOKUP(A44,ValidationLists!$1:$1048576,4,)","v":{"$error":"#N/A"}},{"$f":"VLOOKUP(A44,ValidationLists!$1:$1048576,3,)","v":{"$error":"#N/A"}}]
[null,{"$f":"VLOOKUP(A45,ValidationLists!$1:$1048576,2,)","v":{"$error":"#N/A"}},{"$f":"VLOOKUP(A45,ValidationLists!$1:$1048576,4,)","v":{"$error":"#N/A"}},{"$f":"VLOOKUP(A45,ValidationLists!$1:$1048576,3,)","v":{"$error":"#N/A"}}]
[null,{"$f":"VLOOKUP(A46,ValidationLists!$1:$1048576,2,)","v":{"$error":"#N/A"}},{"$f":"VLOOKUP(A46,ValidationLists!$1:$1048576,4,)","v":{"$error":"#N/A"}},{"$f":"VLOOKUP(A46,ValidationLists!$1:$1048576,3,)","v":{"$error":"#N/A"}}]
[null,{"$f":"VLOOKUP(A47,ValidationLists!$1:$1048576,2,)","v":{"$error":"#N/A"}},{"$f":"VLOOKUP(A47,ValidationLists!$1:$1048576,4,)","v":{"$error":"#N/A"}},{"$f":"VLOOKUP(A47,ValidationLists!$1:$1048576,3,)","v":{"$error":"#N/A"}}]
[null,{"$f":"VLOOKUP(A48,ValidationLists!$1:$1048576,2,)","v":{"$error":"#N/A"}},{"$f":"VLOOKUP(A48,ValidationLists!$1:$1048576,4,)","v":{"$error":"#N/A"}},{"$f":"VLOOKUP(A48,ValidationLists!$1:$1048576,3,)","v":{"$error":"#N/A"}}]
[null,{"$f":"VLOOKUP(A49,ValidationLists!$1:$1048576,2,)","v":{"$error":"#N/A"}},{"$f":"VLOOKUP(A49,ValidationLists!$1:$1048576,4,)","v":{"$error":"#N/A"}},{"$f":"VLOOKUP(A49,ValidationLists!$1:$1048576,3,)","v":{"$error":"#N/A"}}]
[null,{"$f":"VLOOKUP(A50,ValidationLists!$1:$1048576,2,)","v":{"$error":"#N/A"}},{"$f":"VLOOKUP(A50,ValidationLists!$1:$1048576,4,)","v":{"$error":"#N/A"}},{"$f":"VLOOKUP(A50,ValidationLists!$1:$1048576,3,)","v":{"$error":"#N/A"}}]
[null,{"$f":"VLOOKUP(A51,ValidationLists!$1:$1048576,2,)","v":{"$error":"#N/A"}},{"$f":"VLOOKUP(A51,ValidationLists!$1:$1048576,4,)","v":{"$error":"#N/A"}},{"$f":"VLOOKUP(A51,ValidationLists!$1:$1048576,3,)","v":{"$error":"#N/A"}}]
[null,{"$f":"VLOOKUP(A52,ValidationLists!$1:$1048576,2,)","v":{"$error":"#N/A"}},{"$f":"VLOOKUP(A52,ValidationLists!$1:$1048576,4,)","v":{"$error":"#N/A"}},{"$f":"VLOOKUP(A52,ValidationLists!$1:$1048576,3,)","v":{"$error":"#N/A"}}]
[null,{"$f":"VLOOKUP(A53,ValidationLists!$1:$1048576,2,)","v":{"$error":"#N/A"}},{"$f":"VLOOKUP(A53,ValidationLists!$1:$1048576,4,)","v":{"$error":"#N/A"}},{"$f":"VLOOKUP(A53,ValidationLists!$1:$1048576,3,)","v":{"$error":"#N/A"}}]
[null,{"$f":"VLOOKUP(A54,ValidationLists!$1:$1048576,2,)","v":{"$error":"#N/A"}},{"$f":"VLOOKUP(A54,ValidationLists!$1:$1048576,4,)","v":{"$error":"#N/A"}},{"$f":"VLOOKUP(A54,ValidationLists!$1:$1048576,3,)","v":{"$error":"#N/A"}}]
[null,{"$f":"VLOOKUP(A55,ValidationLists!$1:$1048576,2,)","v":{"$error":"#N/A"}},{"$f":"VLOOKUP(A55,ValidationLists!$1:$1048576,4,)","v":{"$error":"#N/A"}},{"$f":"VLOOKUP(A55,ValidationLists!$1:$1048576,3,)","v":{"$error":"#N/A"}}]
[null,{"$f":"VLOOKUP(A56,ValidationLists!$1:$1048576,2,)","v":{"$error":"#N/A"}},{"$f":"VLOOKUP(A56,ValidationLists!$1:$1048576,4,)","v":{"$error":"#N/A"}},{"$f":"VLOOKUP(A56,ValidationLists!$1:$1048576,3,)","v":{"$error":"#N/A"}}]
[null,{"$f":"VLOOKUP(A57,ValidationLists!$1:$1048576,2,)","v":{"$error":"#N/A"}},{"$f":"VLOOKUP(A57,ValidationLists!$1:$1048576,4,)","v":{"$error":"#N/A"}},{"$f":"VLOOKUP(A57,ValidationLists!$1:$1048576,3,)","v":{"$error":"#N/A"}}]
[null,{"$f":"VLOOKUP(A58,ValidationLists!$1:$1048576,2,)","v":{"$error":"#N/A"}},{"$f":"VLOOKUP(A58,ValidationLists!$1:$1048576,4,)","v":{"$error":"#N/A"}},{"$f":"VLOOKUP(A58,ValidationLists!$1:$1048576,3,)","v":{"$error":"#N/A"}}]
[null,{"$f":"VLOOKUP(A59,ValidationLists!$1:$1048576,2,)","v":{"$error":"#N/A"}},{"$f":"VLOOKUP(A59,ValidationLists!$1:$1048576,4,)","v":{"$error":"#N/A"}},{"$f":"VLOOKUP(A59,ValidationLists!$1:$1048576,3,)","v":{"$error":"#N/A"}}]
[null,{"$f":"VLOOKUP(A60,ValidationLists!$1:$1048576,2,)","v":{"$error":"#N/A"}},{"$f":"VLOOKUP(A60,ValidationLists!$1:$1048576,4,)","v":{"$error":"#N/A"}},{"$f":"VLOOKUP(A60,ValidationLists!$1:$1048576,3,)","v":{"$error":"#N/A"}}]
[null,{"$f":"VLOOKUP(A61,ValidationLists!$1:$1048576,2,)","v":{"$error":"#N/A"}},{"$f":"VLOOKUP(A61,ValidationLists!$1:$1048576,4,)","v":{"$error":"#N/A"}},{"$f":"VLOOKUP(A61,ValidationLists!$1:$1048576,3,)","v":{"$error":"#N/A"}}]
[null,{"$f":"VLOOKUP(A62,ValidationLists!$1:$1048576,2,)","v":{"$error":"#N/A"}},{"$f":"VLOOKUP(A62,ValidationLists!$1:$1048576,4,)","v":{"$error":"#N/A"}},{"$f":"VLOOKUP(A62,ValidationLists!$1:$1048576,3,)","v":{"$error":"#N/A"}}]
[null,{"$f":"VLOOKUP(A63,ValidationLists!$1:$1048576,2,)","v":{"$error":"#N/A"}},{"$f":"VLOOKUP(A63,ValidationLists!$1:$1048576,4,)","v":{"$error":"#N/A"}},{"$f":"VLOOKUP(A63,ValidationLists!$1:$1048576,3,)","v":{"$error":"#N/A"}}]
[null,{"$f":"VLOOKUP(A64,ValidationLists!$1:$1048576,2,)","v":{"$error":"#N/A"}},{"$f":"VLOOKUP(A64,ValidationLists!$1:$1048576,4,)","v":{"$error":"#N/A"}},{"$f":"VLOOKUP(A64,ValidationLists!$1:$1048576,3,)","v":{"$error":"#N/A"}}]
[null,{"$f":"VLOOKUP(A65,ValidationLists!$1:$1048576,2,)","v":{"$error":"#N/A"}},{"$f":"VLOOKUP(A65,ValidationLists!$1:$1048576,4,)","v":{"$error":"#N/A"}},{"$f":"VLOOKUP(A65,ValidationLists!$1:$1048576,3,)","v":{"$error":"#N/A"}}]
[null,{"$f":"VLOOKUP(A66,ValidationLists!$1:$1048576,2,)","v":{"$error":"#N/A"}},{"$f":"VLOOKUP(A66,ValidationLists!$1:$1048576,4,)","v":{"$error":"#N/A"}},{"$f":"VLOOKUP(A66,ValidationLists!$1:$1048576,3,)","v":{"$error":"#N/A"}}]
[null,{"$f":"VLOOKUP(A67,ValidationLists!$1:$1048576,2,)","v":{"$error":"#N/A"}},{"$f":"VLOOKUP(A67,ValidationLists!$1:$1048576,4,)","v":{"$error":"#N/A"}},{"$f":"VLOOKUP(A67,ValidationLists!$1:$1048576,3,)","v":{"$error":"#N/A"}}]
[null,{"$f":"VLOOKUP(A68,ValidationLists!$1:$1048576,2,)","v":{"$error":"#N/A"}},{"$f":"VLOOKUP(A68,ValidationLists!$1:$1048576,4,)","v":{"$error":"#N/A"}},{"$f":"VLOOKUP(A68,ValidationLists!$1:$1048576,3,)","v":{"$error":"#N/A"}}]
[null,{"$f":"VLOOKUP(A69,ValidationLists!$1:$1048576,2,)","v":{"$error":"#N/A"}},{"$f":"VLOOKUP(A69,ValidationLists!$1:$1048576,4,)","v":{"$error":"#N/A"}},{"$f":"VLOOKUP(A69,ValidationLists!$1:$1048576,3,)","v":{"$error":"#N/A"}}]
[null,{"$f":"VLOOKUP(A70,ValidationLists!$1:$1048576,2,)","v":{"$error":"#N/A"}},{"$f":"VLOOKUP(A70,ValidationLists!$1:$1048576,4,)","v":{"$error":"#N/A"}},{"$f":"VLOOKUP(A70,ValidationLists!$1:$1048576,3,)","v":{"$error":"#N/A"}}]
[null,{"$f":"VLOOKUP(A71,ValidationLists!$1:$1048576,2,)","v":{"$error":"#N/A"}},{"$f":"VLOOKUP(A71,ValidationLists!$1:$1048576,4,)","v":{"$error":"#N/A"}},{"$f":"VLOOKUP(A71,ValidationLists!$1:$1048576,3,)","v":{"$error":"#N/A"}}]
[null,{"$f":"VLOOKUP(A72,ValidationLists!$1:$1048576,2,)","v":{"$error":"#N/A"}},{"$f":"VLOOKUP(A72,ValidationLists!$1:$1048576,4,)","v":{"$error":"#N/A"}},{"$f":"VLOOKUP(A72,ValidationLists!$1:$1048576,3,)","v":{"$error":"#N/A"}}]
[null,{"$f":"VLOOKUP(A73,ValidationLists!$1:$1048576,2,)","v":{"$error":"#N/A"}},{"$f":"VLOOKUP(A73,ValidationLists!$1:$1048576,4,)","v":{"$error":"#N/A"}},{"$f":"VLOOKUP(A73,ValidationLists!$1:$1048576,3,)","v":{"$error":"#N/A"}}]
[null,{"$f":"VLOOKUP(A74,ValidationLists!$1:$1048576,2,)","v":{"$error":"#N/A"}},{"$f":"VLOOKUP(A74,ValidationLists!$1:$1048576,4,)","v":{"$error":"#N/A"}},{"$f":"VLOOKUP(A74,ValidationLists!$1:$1048576,3,)","v":{"$error":"#N/A"}}]
[null,{"$f":"VLOOKUP(A75,ValidationLists!$1:$1048576,2,)","v":{"$error":"#N/A"}},{"$f":"VLOOKUP(A75,ValidationLists!$1:$1048576,4,)","v":{"$error":"#N/A"}},{"$f":"VLOOKUP(A75,ValidationLists!$1:$1048576,3,)","v":{"$error":"#N/A"}}]
[null,{"$f":"VLOOKUP(A76,ValidationLists!$1:$1048576,2,)","v":{"$error":"#N/A"}},{"$f":"VLOOKUP(A76,ValidationLists!$1:$1048576,4,)","v":{"$error":"#N/A"}},{"$f":"VLOOKUP(A76,ValidationLists!$1:$1048576,3,)","v":{"$error":"#N/A"}}]
[null,{"$f":"VLOOKUP(A77,ValidationLists!$1:$1048576,2,)","v":{"$error":"#N/A"}},{"$f":"VLOOKUP(A77,ValidationLists!$1:$1048576,4,)","v":{"$error":"#N/A"}},{"$f":"VLOOKUP(A77,ValidationLists!$1:$1048576,3,)","v":{"$error":"#N/A"}}]
[null,{"$f":"VLOOKUP(A78,ValidationLists!$1:$1048576,2,)","v":{"$error":"#N/A"}},{"$f":"VLOOKUP(A78,ValidationLists!$1:$1048576,4,)","v":{"$error":"#N/A"}},{"$f":"VLOOKUP(A78,ValidationLists!$1:$1048576,3,)","v":{"$error":"#N/A"}}]
[null,{"$f":"VLOOKUP(A79,ValidationLists!$1:$1048576,2,)","v":{"$error":"#N/A"}},{"$f":"VLOOKUP(A79,ValidationLists!$1:$1048576,4,)","v":{"$error":"#N/A"}},{"$f":"VLOOKUP(A79,ValidationLists!$1:$1048576,3,)","v":{"$error":"#N/A"}}]
[null,{"$f":"VLOOKUP(A80,ValidationLists!$1:$1048576,2,)","v":{"$error":"#N/A"}},{"$f":"VLOOKUP(A80,ValidationLists!$1:$1048576,4,)","v":{"$error":"#N/A"}},{"$f":"VLOOKUP(A80,ValidationLists!$1:$1048576,3,)","v":{"$error":"#N/A"}}]
{"$rows_left_out":615}
{"sheet":"Disability Type","index":1,"n_rows":9,"n_cols":1,"rows_kept":9,"cut":false,"hidden":true,"merged":[]}
["Autism"]
["Blindness and vision impairment"]
["Deafness and hearing loss"]
["Intellectual disability"]
["Learning disabilities"]
["Neurological"]
["Physical impairment"]
["Social and emotional difficulties"]
["Speech language communication difficulties"]

{"sheet":"Sheet1","index":2,"n_rows":600,"n_cols":1,"rows_kept":600,"cut":false,"hidden":true,"merged":[]}
[1]
[2]
[3]
[4]
[5]
[6]
[7]
[8]
[9]
[10]
[11]
[12]
[13]
[14]
[15]
[16]
[17]
[18]
[19]
[20]
[21]
[22]
[23]
[24]
[25]
[26]
[27]
[28]
[29]
[30]
[31]
[32]
[33]
[34]
[35]
[36]
[37]
[38]
[39]
[40]
[41]
[42]
[43]
[44]
[45]
[46]
[47]
[48]
[49]
[50]
[51]
[52]
[53]
[54]
[55]
[56]
[57]
[58]
[59]
[60]
[61]
[62]
[63]
[64]
[65]
[66]
[67]
[68]
[69]
[70]
[71]
[72]
[73]
[74]
[75]
[76]
[77]
[78]
[79]
[80]
{"$rows_left_out":521}
{"sheet":"ValidationLists","index":3,"n_rows":2068,"n_cols":4,"rows_kept":2068,"cut":false,"hidden":true,"merged":[]}
["Centre_Name","Centre_Code","Geographical_Region_Code","Centre_Type"]
[]
["Select School from the list"]
[]
["A B Paterson College (Arundel)",5817,"Non-State School","SER"]
["Abercorn State School",591,"State School","NCR"]
["Abergowrie State School",1275,"State School","NQR"]
["Aboriginal & Islander Independent Community School (Acacia Ridge)",5588,"Non-State School","MSR"]
["Acacia Ridge State School",25,"State School","MSR"]
["ACE Positive Learning Centre",5676,"Positive Learning Centre","MNR"]
["Agnes Water State School",1983,"State School","NCR"]
["Airville State School",598,"State School","NQR"]
["Aitkenvale State School",801,"State School","NQR"]
["Albany Creek State High School",2155,"State High School","MNR"]
["Albany Creek State School",190,"State School","MNR"]
["Albany Hills State School",1892,"State School","MNR"]
["Albert Park Flexible Learning Centre (Milton)",5636,"Non-State School","MNR"]
["Albert State School",38,"State School","NCR"]
["Aldridge State High School",2017,"State High School","NCR"]
["Alexandra Bay State School",1963,"State School","FNR"]
["Alexandra Hills State High School",2175,"State High School","MSR"]
["Alexandra Hills State School",405,"State School","MSR"]
["Alexandra Hills TAFE Senior Studies Program","B058","Centre for Continuing Secondary Education","MSR"]
["Algester State School",1866,"State School","MSR"]
["All Hallows' School (Brisbane)",5369,"Non-State School","MNR"]
["All Saints Anglican School (Merrimac)",5452,"Non-State School","SER"]
["All Saints Primary School (Albany Creek)",5600,"Non-State School","MNR"]
["All Saints' School (Boonah)",5111,"Non-State School","SER"]
["All Souls St Gabriels School (Charters Towers)",5451,"Non-State School","NQR"]
["Allenstown State School",155,"State School","CQR"]
["Alligator Creek State School",773,"State School","CQR"]
["Allora P-10 State School",3,"State School","DSR"]
["Alloway State School",430,"State School","NCR"]
["Aloomba State School",870,"State School","FNR"]
["Alpha State School",517,"State School","CQR"]
["Alta-1 College (King St - Caboolture)","A915","Associated Facility","MNR"]
["Alta-1 College (Parish Rd - Caboolture)",9628,"Non-State School","MNR"]
["Amamoor State School",1719,"State School","NCR"]
["Amaroo Environmental Education Centre",3553,"Outdoor and Environmental Education Centre","DSR"]
["Amberley District State School",115,"State School","MSR"]
["Ambrose State School",1415,"State School","CQR"]
["Ambrose Treacy College (Indooroopilly)",5077,"Non-State School","MNR"]
["Amiens State School",1629,"State School","DSR"]
["Anakie State School",474,"State School","CQR"]
["Andergrove State School",1572,"State School","CQR"]
["Angelorum College (Distance)","A086","Non State School Distance Education","MNR"]
["Angelorum College (Fortitude Valley)","A057","Non-State School","MNR"]
["Anglican Church Grammar School (East Brisbane)",5446,"Non-State School","MSR"]
["Annandale Christian College (Annandale)",5573,"Non-State School","NQR"]
["Annandale State School",440,"State School","NQR"]
["Applethorpe State School",1294,"State School","DSR"]
["Aquinas College (Ashmore)",5316,"Non-State School","SER"]
["Aramac State School",312,"State School","CQR"]
["Aratula State School",1266,"State School","SER"]
["Arcadia College (Distance)","B271","Non State School Distance Education","SER"]
["Arcadia College (Robina)","A624","Non-State School","SER"]
["Arcadia Valley State School",813,"State School","DSR"]
["Arethusa College (Deception Bay)","A740","Non-State School","MNR"]
["Arethusa College (Spring Hill)","A741","Associated Facility","MNR"]
["Arethusa College (Windsor)","A742","Associated Facility","MNR"]
["Arundel Early Intervention Centre",6604,"Support Unit (Other)","SER"]
["Arundel State School",1997,"State School","SER"]
["Ascot State School",296,"State School","MNR"]
["Ashgrove State School",186,"State School","MNR"]
["Ashmore State School",1871,"State School","SER"]
["Ashwell State School",512,"State School","MSR"]
["Aspley East State School",1004,"State School","MNR"]
["Aspley Special School",3031,"Special School","MNR"]
["Aspley State High School",2076,"State High School","MNR"]
["Aspley State School",610,"State School","MNR"]
["Assisi Catholic College (Upper Coomera)",5313,"Non-State School","SER"]
["Assumption College (Warwick)",5393,"Non-State School","DSR"]
["Atherton State High School",2051,"State High School","FNR"]
["Atherton State School",789,"State School","FNR"]
["Augathella State School",357,"State School","DSR"]
["Augusta State School",7120,"State School","MSR"]
["Aurukun State School",274,"State School","FNR"]
["Aus Industry Trade College (Robina) Non-State School","B274","Non-State School","SER"]
["Australian Christian College - Moreton (Caboolture)",1677,"Non-State School","NCR"]
["Australian Christian College Moreton (Distance)",6143,"Non State School Distance Education","NCR"]
{"$rows_left_out":1988}